Target
Neuraminidase
Ligand
BDBM50037554
Substrate
Meas. Tech.
ChEMBL_1438031 (CHEMBL3387278)
IC50
42±n/a nM
Citation
 Hong, BTChen, CLFang, JMTsai, KCWang, SYHuang, WICheng, YSWong, CH Oseltamivir hydroxamate and acyl sulfonamide derivatives as influenza neuraminidase inhibitors. Bioorg Med Chem 22:6647-54 (2015)  
Target
Name:
Neuraminidase
Synonyms:
NA Neuraminidase
Type:
PROTEIN
Mol. Mass.:
51863.92
Organism:
Influenza A virus (strain A/USSR/90/1977 H1N1)
Description:
ChEMBL_109720
Residue:
470
  
Inhibitor
Name:
BDBM50037554
Synonyms:
CHEMBL3357213
Type:
Small organic molecule
Emp. Form.:
C19H35N5O5S
Mol. Mass.:
445.577
SMILES:
CCCCS(=O)(=O)NC(=O)C1=C[C@@H](OC(CC)CC)[C@H](NC(C)=O)[C@H](C1)NC(N)=N
: