Target
Glutathione S-transferase Mu 2
Ligand
BDBM50038321
Substrate
Meas. Tech.
ChEMBL_1441153 (CHEMBL3378817)
IC50
10.0±n/a nM
Citation
 Rotili, DDe Luca, ATarantino, DPezzola, SForgione, MMorozzo Della Rocca, BFalconi, MMai, ACaccuri, AM Synthesis and structure--activity relationship of new cytotoxic agents targeting human glutathione-S-transferases. Eur J Med Chem 89:156-71 (2014)  
Target
Name:
Glutathione S-transferase Mu 2
Synonyms:
GST class-mu 2 GSTM2 GSTM2_HUMAN | Glutathione S-transferase Mu 2
Type:
PROTEIN
Mol. Mass.:
25743.85
Organism:
Homo sapiens (Human)
Description:
ChEMBL_1441153
Residue:
218
  
Inhibitor
Name:
BDBM50038321
Synonyms:
CHEMBL3360505
Type:
Small organic molecule
Emp. Form.:
C15H13N3O3S
Mol. Mass.:
315.347
SMILES:
[O-][N+](=O)c1ccc(SCCCc2ccccc2)c2nonc12
: