Target
Glutathione S-transferase P
Ligand
BDBM50038334
Substrate
Meas. Tech.
ChEMBL_1441152 (CHEMBL3378816)
IC50
500±n/a nM
Citation
 Rotili, DDe Luca, ATarantino, DPezzola, SForgione, MMorozzo Della Rocca, BFalconi, MMai, ACaccuri, AM Synthesis and structure--activity relationship of new cytotoxic agents targeting human glutathione-S-transferases. Eur J Med Chem 89:156-71 (2014)  
Target
Name:
Glutathione S-transferase P
Synonyms:
FAEES3 GST3 GSTP1-1 Glutathione S-transferase Glutathione S-transferase P Glutathione transferase (GST)
Type:
Enzyme
Mol. Mass.:
23353.53
Organism:
Homo sapiens (Human)
Description:
P09211
Residue:
210
  
Inhibitor
Name:
BDBM50038334
Synonyms:
CHEMBL3360535
Type:
Small organic molecule
Emp. Form.:
C14H19N3O4S
Mol. Mass.:
325.383
SMILES:
OCCCCCCCCSc1ccc([N+]([O-])=O)c2nonc12
: