Target
Serine racemase
Ligand
BDBM14673
Substrate
Meas. Tech.
ChEMBL_1441161 (CHEMBL3378825)
IC50
67000±n/a nM
Citation
 Vorlová, BNachtigallová, DJirásková-Vanícková, JAjani, HJansa, PRezác, JFanfrlík, JOtyepka, MHobza, PKonvalinka, JLep?ík, M Malonate-based inhibitors of mammalian serine racemase: kinetic characterization and structure-based computational study. Eur J Med Chem 89:189-97 (2014)  
Target
Name:
Serine racemase
Synonyms:
D-serine ammonia-lyase L-serine ammonia-lyase SRR_MOUSE | Srr
Type:
PROTEIN
Mol. Mass.:
36355.92
Organism:
Mus musculus
Description:
ChEMBL_1441161
Residue:
339
  
Inhibitor
Name:
BDBM14673
Synonyms:
Fragment 3 propanedioic acid
Type:
Small organic molecule
Emp. Form.:
C3H4O4
Mol. Mass.:
104.0615
SMILES:
OC(=O)CC(O)=O
: