Target
Serine racemase
Ligand
BDBM50038355
Substrate
Meas. Tech.
ChEMBL_1441161 (CHEMBL3378825)
IC50
40600000±n/a nM
Citation
 Vorlová, BNachtigallová, DJirásková-Vanícková, JAjani, HJansa, PRezác, JFanfrlík, JOtyepka, MHobza, PKonvalinka, JLep?ík, M Malonate-based inhibitors of mammalian serine racemase: kinetic characterization and structure-based computational study. Eur J Med Chem 89:189-97 (2014)  
Target
Name:
Serine racemase
Synonyms:
D-serine ammonia-lyase L-serine ammonia-lyase SRR_MOUSE | Srr
Type:
PROTEIN
Mol. Mass.:
36355.92
Organism:
Mus musculus
Description:
ChEMBL_1441161
Residue:
339
  
Inhibitor
Name:
BDBM50038355
Synonyms:
CHEMBL3360551
Type:
Small organic molecule
Emp. Form.:
C5H6Na2O6
Mol. Mass.:
208.0771
SMILES:
[Na+].[Na+].OCC(CO)(C([O-])=O)C([O-])=O
: