Target
Prostaglandin G/H synthase 2
Ligand
BDBM50038400
Substrate
Meas. Tech.
ChEMBL_1441949 (CHEMBL3372215)
IC50
>10.0±n/a nM
Citation
 Özdemir, AAltintop, MDTuran-Zitouni, GÇiftçi, GAErtorun, IAlatas, ÖKaplancikli, ZA Synthesis and evaluation of new indole-based chalcones as potential antiinflammatory agents. Eur J Med Chem 89:304-9 (2014)  
Target
Name:
Prostaglandin G/H synthase 2
Synonyms:
COX2 Cyclooxygenase-2 (COX-2) PTGS2 Prostaglandin G/H synthase (cyclooxygenase)
Type:
Protein
Mol. Mass.:
68976.98
Organism:
Ovis aries (Sheep)
Description:
Residue:
603
  
Inhibitor
Name:
BDBM50038400
Synonyms:
CHEMBL3361125
Type:
Small organic molecule
Emp. Form.:
C19H17NO3S
Mol. Mass.:
339.408
SMILES:
Cn1cc(\C=C\C(=O)c2ccc(cc2)S(C)(=O)=O)c2ccccc12
: