Target
Platelet-derived growth factor receptor alpha
Ligand
BDBM50038423
Substrate
Meas. Tech.
ChEMBL_1441961 (CHEMBL3372227)
IC50
4040±n/a nM
Citation
 Xie, FZhu, HZhang, HLang, QTang, LHuang, QYu, L In vitro and in vivo characterization of a benzofuran derivative, a potential anticancer agent, as a novel Aurora B kinase inhibitor. Eur J Med Chem 89:310-9 (2014)  
Target
Name:
Platelet-derived growth factor receptor alpha
Synonyms:
Alpha-type platelet-derived growth factor receptor PDGFRA PGFRA_HUMAN Platelet-derived growth factor receptor alpha (PDGFRA) RHEPDGFRA
Type:
Protein
Mol. Mass.:
122633.38
Organism:
Homo sapiens (Human)
Description:
P16234
Residue:
1089
  
Inhibitor
Name:
BDBM50038423
Synonyms:
CHEMBL3361128
Type:
Small organic molecule
Emp. Form.:
C15H10O4
Mol. Mass.:
254.2375
SMILES:
Oc1ccc(\C=C2\Oc3ccccc3C2=O)cc1O
: