Target
Sigma non-opioid intracellular receptor 1
Ligand
BDBM50039124
Substrate
Meas. Tech.
ChEMBL_1444883 (CHEMBL3380225)
Ki
175±n/a nM
Citation
 Pati, MLAbate, CContino, MFerorelli, SLuisi, RCarroccia, LNiso, MBerardi, F Deconstruction of 6,7-dimethoxy-1,2,3,4-tetrahydroisoquinoline moiety to separate P-glycoprotein (P-gp) activity froms2 receptor affinity in mixed P-gp/s2 receptor agents. Eur J Med Chem 89:691-700 (2014)  
Target
Name:
Sigma non-opioid intracellular receptor 1
Synonyms:
OPRS1 SIGMAR1 Sigma non-opioid intracellular receptor 1 Sigma1-receptor Sterol isomerase-like protein
Type:
Protein
Mol. Mass.:
25307.17
Organism:
Cavia porcellus (Guinea pig)
Description:
Q60492
Residue:
223
  
Inhibitor
Name:
BDBM50039124
Synonyms:
CHEMBL3355374
Type:
Small organic molecule
Emp. Form.:
C29H31FN2O2
Mol. Mass.:
458.567
SMILES:
COc1ccc2[C@@H](CCc2c1OC)NCCCCc1cn(-c2ccc(F)cc2)c2ccccc12
: