Target
Sigma non-opioid intracellular receptor 1
Ligand
BDBM50039132
Substrate
Meas. Tech.
ChEMBL_1444883 (CHEMBL3380225)
Ki
129±n/a nM
Citation
 Pati, MLAbate, CContino, MFerorelli, SLuisi, RCarroccia, LNiso, MBerardi, F Deconstruction of 6,7-dimethoxy-1,2,3,4-tetrahydroisoquinoline moiety to separate P-glycoprotein (P-gp) activity froms2 receptor affinity in mixed P-gp/s2 receptor agents. Eur J Med Chem 89:691-700 (2014)  
Target
Name:
Sigma non-opioid intracellular receptor 1
Synonyms:
OPRS1 SIGMAR1 Sigma non-opioid intracellular receptor 1 Sigma1-receptor Sterol isomerase-like protein
Type:
Protein
Mol. Mass.:
25307.17
Organism:
Cavia porcellus (Guinea pig)
Description:
Q60492
Residue:
223
  
Inhibitor
Name:
BDBM50039132
Synonyms:
CHEMBL3355369
Type:
Small organic molecule
Emp. Form.:
C26H27FN2O
Mol. Mass.:
402.5038
SMILES:
COc1ccc(CNCCCCc2cn(-c3ccc(F)cc3)c3ccccc23)cc1
: