Target
ATP-dependent translocase ABCB1
Ligand
BDBM50039144
Substrate
Meas. Tech.
ChEMBL_1444886 (CHEMBL3380228)
EC50
700±n/a nM
Citation
 Pati, MLAbate, CContino, MFerorelli, SLuisi, RCarroccia, LNiso, MBerardi, F Deconstruction of 6,7-dimethoxy-1,2,3,4-tetrahydroisoquinoline moiety to separate P-glycoprotein (P-gp) activity froms2 receptor affinity in mixed P-gp/s2 receptor agents. Eur J Med Chem 89:691-700 (2014)  
Target
Name:
ATP-dependent translocase ABCB1
Synonyms:
ABCB1 MDR1_HUMAN Multidrug resistance protein 1 P-glycoprotein (P-gp) PGY1
Type:
Protein
Mol. Mass.:
141503.50
Organism:
Homo sapiens (Human)
Description:
P08183
Residue:
1280
  
Inhibitor
Name:
BDBM50039144
Synonyms:
CHEMBL3355378
Type:
Small organic molecule
Emp. Form.:
C31H35FN2O2
Mol. Mass.:
486.6202
SMILES:
CCN(CCCCc1cn(-c2ccc(F)cc2)c2ccccc12)[C@H]1CCc2c1ccc(OC)c2OC
: