Target
Interleukin-1 receptor-associated kinase 4
Ligand
BDBM50040788
Substrate
Meas. Tech.
ChEMBL_1444247 (CHEMBL3380186)
IC50
0.320000±n/a nM
Citation
 Chaudhary, DRobinson, SRomero, DL Recent advances in the discovery of small molecule inhibitors of interleukin-1 receptor-associated kinase 4 (IRAK4) as a therapeutic target for inflammation and oncology disorders. J Med Chem 58:96-110 (2015)  
Target
Name:
Interleukin-1 receptor-associated kinase 4
Synonyms:
IRAK-4 IRAK4_HUMAN Interleukin-1 receptor-associated kinase 4 (IRAK4) | Renal carcinoma antigen NY-REN-64
Type:
Protein
Mol. Mass.:
51519.08
Organism:
Homo sapiens (Human)
Description:
Q9NWZ3
Residue:
460
  
Inhibitor
Name:
BDBM50040788
Synonyms:
CHEMBL3353199
Type:
Small organic molecule
Emp. Form.:
C24H27ClN6O3S
Mol. Mass.:
515.028
SMILES:
Cl.Cc1cc(Nc2ncc(-c3nc4ccccc4s3)c(NC3C[C@H](CO)[C@@H](O)[C@H]3O)n2)cc(C)n1
: