Target
E3 ubiquitin-protein ligase Mdm2
Ligand
BDBM50041078
Substrate
Meas. Tech.
ChEMBL_1445462 (CHEMBL3380268)
Ki
23±n/a nM
Citation
 Aguilar, ASun, WLiu, LLu, JMcEachern, DBernard, DDeschamps, JRWang, S Design of chemically stable, potent, and efficacious MDM2 inhibitors that exploit the retro-mannich ring-opening-cyclization reaction mechanism in spiro-oxindoles. J Med Chem 57:10486-98 (2014)  
Target
Name:
E3 ubiquitin-protein ligase Mdm2
Synonyms:
Double minute 2 protein E3 ubiquitin-protein ligase Mdm2 (p53-binding protein Mdm2) Human Double Minute 2 (HDM2) MDM2-MDMX p53-Binding Protein MDM2 | p53-binding protein
Type:
Oncoprotein
Mol. Mass.:
55196.54
Organism:
Homo sapiens (Human)
Description:
Q00987
Residue:
491
  
Inhibitor
Name:
BDBM50041078
Synonyms:
CHEMBL3355422
Type:
Small organic molecule
Emp. Form.:
C26H30Cl2FN3O4
Mol. Mass.:
538.439
SMILES:
CCC1(CC)N[C@H]([C@H](c2cccc(Cl)c2F)[C@]11C(=O)Nc2cc(Cl)ccc12)C(=O)NCC[C@H](O)CO
: