Target
C-C chemokine receptor type 3
Ligand
BDBM50041185
Substrate
Meas. Tech.
ChEMBL_1445728 (CHEMBL3374865)
Ki
4.8±n/a nM
Citation
 Kriegl, JMMartyres, DGrundl, MAAnderskewitz, RDollinger, HRast, GSchmid, BSeither, PTautermann, CS Rodent selectivity of piperidine-4-yl-1H-indoles, a series of CC chemokine receptor-3 (CCR3) antagonists: insights from a receptor model. Bioorg Med Chem Lett 25:229-35 (2014)  
Target
Name:
C-C chemokine receptor type 3
Synonyms:
C-C CKR-3 CC-CKR-3 CCR3 CD_antigen=CD193 CMKBR3 | Eosinophil eotaxin receptor
Type:
Enzyme
Mol. Mass.:
41053.88
Organism:
Homo sapiens (Human)
Description:
P51677
Residue:
355
  
Inhibitor
Name:
BDBM50041185
Synonyms:
CHEMBL3355944
Type:
Small organic molecule
Emp. Form.:
C25H31FN2OS
Mol. Mass.:
426.59
SMILES:
COC(C)c1[nH]c2ccccc2c1C1CCN(CCCSc2ccc(F)cc2)CC1
: