Target
Tyrosine-protein phosphatase non-receptor type 2
Ligand
BDBM50041407
Substrate
Meas. Tech.
ChEMBL_1445878 (CHEMBL3377305)
IC50
4440±n/a nM
Citation
 Yang, PLiu, DQLiang, TJLi, JZhang, HYLiu, AHGuo, YWMao, SC Bioactive constituents from the green alga Caulerpa racemosa. Bioorg Med Chem 23:38-45 (2014)  
Target
Name:
Tyrosine-protein phosphatase non-receptor type 2
Synonyms:
PTN2_HUMAN PTPT T-cell protein-tyrosine phosphatase TCPTP Tyrosine-protein phosphatase non-receptor type 2 (TC-PTP)
Type:
Protein
Mol. Mass.:
48481.80
Organism:
Homo sapiens (Human)
Description:
P17706
Residue:
415
  
Inhibitor
Name:
BDBM50041407
Synonyms:
CHEMBL3138697
Type:
Small organic molecule
Emp. Form.:
C30H48O3
Mol. Mass.:
456.7003
SMILES:
[H][C@]12CC(C)(C)CC[C@@]1(CC[C@]1(C)C2=CC[C@]2([H])[C@@]3(C)CC[C@@H](O)C(C)(C)[C@]3([H])CC[C@@]12C)C(O)=O
: