Target
Bombesin receptor subtype-3
Ligand
BDBM50447503
Substrate
Meas. Tech.
ChEMBL_1445902 (CHEMBL3377329)
EC50
>10000±n/a nM
Citation
 Matsufuji, TShimada, KKobayashi, SIchikawa, MKawamura, AFujimoto, TArita, THara, TKonishi, MAbe-Ohya, RIzumi, MSogawa, YNagai, YYoshida, KAbe, YKimura, TTakahashi, H Synthesis and biological evaluation of novel chiral diazepine derivatives as bombesin receptor subtype-3 (BRS-3) agonists incorporating an antedrug approach. Bioorg Med Chem 23:89-104 (2014)  
Target
Name:
Bombesin receptor subtype-3
Synonyms:
BRS3_MOUSE | Brs3
Type:
PROTEIN
Mol. Mass.:
44239.49
Organism:
Mus musculus
Description:
ChEMBL_1445902
Residue:
399
  
Inhibitor
Name:
BDBM50447503
Synonyms:
CHEMBL3115393
Type:
Small organic molecule
Emp. Form.:
C27H20F3N3O2
Mol. Mass.:
475.4618
SMILES:
FC(F)(F)c1ccc2CN(C(=O)Cc3ccc(Oc4ccccc4)cc3)c3ccccc3Nc2n1
: