Target
Bombesin receptor subtype-3
Ligand
BDBM50041424
Substrate
Meas. Tech.
ChEMBL_1445902 (CHEMBL3377329)
EC50
5.6±n/a nM
Citation
 Matsufuji, TShimada, KKobayashi, SIchikawa, MKawamura, AFujimoto, TArita, THara, TKonishi, MAbe-Ohya, RIzumi, MSogawa, YNagai, YYoshida, KAbe, YKimura, TTakahashi, H Synthesis and biological evaluation of novel chiral diazepine derivatives as bombesin receptor subtype-3 (BRS-3) agonists incorporating an antedrug approach. Bioorg Med Chem 23:89-104 (2014)  
Target
Name:
Bombesin receptor subtype-3
Synonyms:
BRS3_MOUSE | Brs3
Type:
PROTEIN
Mol. Mass.:
44239.49
Organism:
Mus musculus
Description:
ChEMBL_1445902
Residue:
399
  
Inhibitor
Name:
BDBM50041424
Synonyms:
CHEMBL3356411
Type:
Small organic molecule
Emp. Form.:
C24H26F3N3O5
Mol. Mass.:
493.4755
SMILES:
CCCCOC(=O)c1cccc(CC(=O)N2CCNc3nc(ccc3[C@H]2CC(O)=O)C(F)(F)F)c1
: