Target
Neurotensin receptor type 2
Ligand
BDBM50130880
Substrate
Meas. Tech.
ChEMBL_1446255 (CHEMBL3373065)
IC50
42±n/a nM
Citation
 Thomas, JBGiddings, AMOlepu, SWiethe, RWHarris, DLNarayanan, SWarner, KRSarret, PLongpre, JMRunyon, SPGilmour, BP Identification of N-{[6-chloro-4-(2,6-dimethoxyphenyl)quinazolin-2-yl]carbonyl}-l-leucine (NTRC-808), a novel nonpeptide chemotype selective for the neurotensin receptor type 2. Bioorg Med Chem Lett 25:292-6 (2014)  
Target
Name:
Neurotensin receptor type 2
Synonyms:
High-affinity levocabastine-sensitive neurotensin receptor NTR2_RAT Neurotensin receptor type 2 Ntsr2
Type:
PROTEIN
Mol. Mass.:
46280.50
Organism:
Rattus norvegicus
Description:
ChEMBL_1466615
Residue:
416
  
Inhibitor
Name:
BDBM50130880
Synonyms:
CHEMBL407196 neurotensin pGlu-Leu-Tyr-Glu-Asn-Lys-Pro-Arg-Arg-Pro-Tyr-Ile-Leu-OH
Type:
Small organic molecule
Emp. Form.:
C78H121N21O20
Mol. Mass.:
1672.924
SMILES:
[#6]-[#6]-[#6@H](-[#6])-[#6@H](-[#7]-[#6](=O)-[#6@H](-[#6]-c1ccc(-[#8])cc1)-[#7]-[#6](=O)-[#6@@H]-1-[#6]-[#6]-[#6]-[#7]-1-[#6](=O)-[#6@H](-[#6]-[#6]-[#6]\[#7]=[#6](/[#7])-[#7])-[#7]-[#6](=O)-[#6@H](-[#6]-[#6]-[#6]\[#7]=[#6](\[#7])-[#7])-[#7]-[#6](=O)-[#6@@H]-1-[#6]-[#6]-[#6]-[#7]-1-[#6](=O)-[#6@H](-[#6]-[#6]-[#6]-[#6]-[#7])-[#7]-[#6](=O)-[#6@H](-[#6]-[#6](-[#7])=O)-[#7]-[#6](=O)-[#6@H](-[#6]-[#6]-[#6](-[#8])=O)-[#7]-[#6](=O)-[#6@H](-[#6]-c1ccc(-[#8])cc1)-[#7]-[#6](=O)-[#6@H](-[#6]-[#6](-[#6])-[#6])-[#7]-[#6](=O)-[#6@@H]-1-[#6]-[#6]-[#6](=O)-[#7]-1)-[#6](=O)-[#7]-[#6@@H](-[#6]-[#6](-[#6])-[#6])-[#6](-[#8])=O
: