Target
Cytochrome P450 1A2
Ligand
BDBM50041691
Substrate
Meas. Tech.
ChEMBL_1446305 (CHEMBL3373699)
IC50
>50000±n/a nM
Citation
 Buzard, DJKim, SHLopez, LKawasaki, AZhu, XMoody, JThoresen, LCalderon, IUllman, BHan, SLehmann, JGharbaoui, TSengupta, DCalvano, LMontalban, AGMa, YASage, CGao, YSemple, GEdwards, JBarden, JMorgan, MChen, WUsmani, KChen, CSadeque, AChristopher, RJThatte, JFu, LSolomon, MMills, DWhelan, KAl-Shamma, HGatlin, JLe, MGaidarov, IAnthony, TUnett, DJBlackburn, ARueter, JStirn, SBehan, DPJones, RM Discovery of APD334: Design of a Clinical Stage Functional Antagonist of the Sphingosine-1-phosphate-1 Receptor. ACS Med Chem Lett 5:1313-7 (2014)  
Target
Name:
Cytochrome P450 1A2
Synonyms:
CP1A2_HUMAN CYPIA2 Cytochrome P(3)450 Cytochrome P450 1A2 (CYP1A2) Cytochrome P450-P3
Type:
Enzyme
Mol. Mass.:
58423.38
Organism:
Homo sapiens (Human)
Description:
P05177
Residue:
516
  
Inhibitor
Name:
BDBM50041691
Synonyms:
CHEMBL3358920 | US11149292, Compound (R)-2-(7-(4-cyclopentyl-3-(trifluoromethyl)benzyloxy)-
Type:
Small organic molecule
Emp. Form.:
C26H26F3NO3
Mol. Mass.:
457.4847
SMILES:
OC(=O)C[C@H]1CCc2c1[nH]c1ccc(OCc3ccc(C4CCCC4)c(c3)C(F)(F)F)cc21
: