Target
Glucocorticoid receptor
Ligand
BDBM50041902
Substrate
Meas. Tech.
ChEMBL_1446327 (CHEMBL3374293)
IC50
2.0±n/a nM
Citation
 Harcken, CRiether, DLiu, PRazavi, HPatel, ULee, TBosanac, TWard, YRalph, MChen, ZSouza, DNelson, RMKukulka, AFadra-Khan, TNZuvela-Jelaska, LPatel, MThomson, DSNabozny, GH Optimization of drug-like properties of nonsteroidal glucocorticoid mimetics and identification of a clinical candidate. ACS Med Chem Lett 5:1318-23 (2014)  
Target
Name:
Glucocorticoid receptor
Synonyms:
GCR_HUMAN GRL Glucocorticoid receptor (GRFP) Nuclear receptor subfamily 3 group C member 1
Type:
Enzyme
Mol. Mass.:
85656.87
Organism:
Homo sapiens (Human)
Description:
P04150
Residue:
777
  
Inhibitor
Name:
BDBM50041902
Synonyms:
CHEMBL3358925
Type:
Small organic molecule
Emp. Form.:
C27H26F4N2O
Mol. Mass.:
470.5018
SMILES:
Cc1ccc(F)cc1C(C)(C)CC(O)(Cc1cc2cc(ncc2[nH]1)-c1ccccc1)C(F)(F)F
: