Target
Sphingosine 1-phosphate receptor 1
Ligand
BDBM50041982
Substrate
Meas. Tech.
ChEMBL_1443690 (CHEMBL3380163)
EC50
0.038000±n/a nM
Citation
 Buzard, DJLopez, LMoody, JKawasaki, ASchrader, TOKasem, MJohnson, BZhu, XThoresen, LKim, SHGharbaoui, TSengupta, DCalvano, LKrishnan, AGao, YSemple, GEdwards, JBarden, JMorgan, MUsmani, KChen, CSadeque, AChen, WChristopher, RJThatte, JFu, LSolomon, MWhelan, KAl-Shamma, HGatlin, JGaidarov, IAnthony, TLe, MUnett, DJStirn, SBlackburn, ABehan, DPJones, RM (7-Benzyloxy-2,3-dihydro-1H-pyrrolo[1,2-a]indol-1-yl)acetic Acids as S1P1 Functional Antagonists. ACS Med Chem Lett 5:1334-9 (2014)  
Target
Name:
Sphingosine 1-phosphate receptor 1
Synonyms:
S1PR1 | Sphingosine 1-phosphate receptor 1
Type:
PROTEIN
Mol. Mass.:
42831.51
Organism:
Macaca mulatta
Description:
ChEMBL_109730
Residue:
382
  
Inhibitor
Name:
BDBM50041982
Synonyms:
CHEMBL3359522
Type:
Small organic molecule
Emp. Form.:
C24H23ClN2O4
Mol. Mass.:
438.903
SMILES:
CC(C)Oc1ccc(COc2ccc3n4CC[C@H](CC(O)=O)c4c(Cl)c3c2)cc1C#N
: