Target
Dual specificity mitogen-activated protein kinase kinase 7
Ligand
BDBM50042034
Substrate
Meas. Tech.
ChEMBL_1443870 (CHEMBL3373544)
IC50
1300±n/a nM
Citation
 Sogabe, YMatsumoto, THashimoto, TKirii, YSawa, MKinoshita, T 5Z-7-Oxozeaenol covalently binds to MAP2K7 at Cys218 in an unprecedented manner. Bioorg Med Chem Lett 25:593-6 (2015)  
Target
Name:
Dual specificity mitogen-activated protein kinase kinase 7
Synonyms:
Dual specificity mitogen-activated protein kinase kinase 7 JNKK2 MEK7 MP2K7_HUMAN SKK4
Type:
Protein
Mol. Mass.:
47502.52
Organism:
Homo sapiens (Human)
Description:
O14733
Residue:
419
  
Inhibitor
Name:
BDBM50042034
Synonyms:
(5Z)-7-Oxozeaenol CHEBI:67559 | CHEMBL1077979
Type:
Small organic molecule
Emp. Form.:
C19H22O7
Mol. Mass.:
362.3738
SMILES:
COc1cc(O)c2c(c1)\C=C\C[C@H](O)[C@H](O)C(=O)\C=C/C[C@H](C)OC2=O
: