Target
Muscarinic acetylcholine receptor M5
Ligand
BDBM50042441
Substrate
Meas. Tech.
ChEMBL_1444281 (CHEMBL3380864)
IC50
263±n/a nM
Citation
 Kurata, HGentry, PRKokubo, MCho, HPBridges, TMNiswender, CMByers, FWWood, MRDaniels, JSConn, PJLindsley, CW Further optimization of the M5 NAM MLPCN probe ML375: tactics and challenges. Bioorg Med Chem Lett 25:690-4 (2015)  
Target
Name:
Muscarinic acetylcholine receptor M5
Synonyms:
ACM5_HUMAN | CHRM5
Type:
PROTEIN
Mol. Mass.:
60102.35
Organism:
Homo sapiens (Human)
Description:
ChEMBL_1517990
Residue:
532
  
Inhibitor
Name:
BDBM50042441
Synonyms:
CHEMBL3353290
Type:
Small organic molecule
Emp. Form.:
C25H19F3N2O3
Mol. Mass.:
452.4252
SMILES:
COc1ccc(cc1C)[C@]12N(CCN1C(=O)c1ccccc21)C(=O)c1cc(F)c(F)c(F)c1
: