Target
Serine/threonine-protein kinase pim-2
Ligand
BDBM50042868
Substrate
Meas. Tech.
ChEMBL_1444649 (CHEMBL3376647)
IC50
1.000000±n/a nM
Citation
 Ishchenko, AZhang, LLe Brazidec, JYFan, JChong, JHHingway, ARaditsis, ASingh, LElenbaas, BHong, VSMarcotte, DSilvian, LEnyedy, IChao, J Structure-based design of low-nanomolar PIM kinase inhibitors. Bioorg Med Chem Lett 25:474-80 (2015)  
Target
Name:
Serine/threonine-protein kinase pim-2
Synonyms:
PIM2 Pim-2h Serine/threonine-protein kinase PIM | Serine/threonine-protein kinase pim-2 (PIM2)
Type:
Serine/threonine-protein kinase
Mol. Mass.:
34185.93
Organism:
Homo sapiens (Human)
Description:
Q9P1W9
Residue:
311
  
Inhibitor
Name:
BDBM50042868
Synonyms:
CHEMBL3354518
Type:
Small organic molecule
Emp. Form.:
C19H17F2N5O2S
Mol. Mass.:
417.432
SMILES:
Nc1sc(nc1C(=O)Nc1cnccc1O[C@H]1CCNC1)-c1c(F)cccc1F
: