Target
Maternal embryonic leucine zipper kinase
Ligand
BDBM50043378
Substrate
Meas. Tech.
ChEMBL_1444835 (CHEMBL3379605)
IC50
300±n/a nM
Citation
 Johnson, CNAdelinet, CBerdini, VBeke, LBonnet, PBrehmer, DCalo, FCoyle, JEDay, PJFrederickson, MFreyne, EJGilissen, RAHamlett, CCHoward, SMeerpoel, LMevellec, LMcMenamin, RPasquier, EPatel, SRees, DCLinders, JT Structure-Based Design of Type II Inhibitors Applied to Maternal Embryonic Leucine Zipper Kinase. ACS Med Chem Lett 6:31-6 (2015)  
Target
Name:
Maternal embryonic leucine zipper kinase
Synonyms:
KIAA0175 MELK_HUMAN Maternal embryonic leucine zipper kinase (MELK)
Type:
Enzyme
Mol. Mass.:
74665.45
Organism:
Homo sapiens (Human)
Description:
Q14680
Residue:
651
  
Inhibitor
Name:
BDBM50043378
Synonyms:
CHEMBL3355064
Type:
Small organic molecule
Emp. Form.:
C24H22F3N3O
Mol. Mass.:
425.4462
SMILES:
FC(F)(F)c1cc(OCC#Cc2ccc3ccncc3c2)ccc1CN1CCNCC1
: