Target
Serine/threonine-protein kinase 4
Ligand
BDBM50043416
Substrate
Meas. Tech.
ChEMBL_1445033 (CHEMBL3372441)
IC50
>100000±n/a nM
Citation
 Goodwin, NCCianchetta, GBurgoon, HAHealy, JMabon, RStrobel, EDAllen, JWang, SHamman, BDRawlins, DB Discovery of a Type III Inhibitor of LIM Kinase 2 That Binds in a DFG-Out Conformation. ACS Med Chem Lett 6:53-7 (2015)  
Target
Name:
Serine/threonine-protein kinase 4
Synonyms:
KRS2 STK4 Serine/threonine-protein kinase 3/4 Serine/threonine-protein kinase MST1
Type:
Enzyme
Mol. Mass.:
55611.40
Organism:
Homo sapiens (Human)
Description:
Q13043
Residue:
487
  
Inhibitor
Name:
BDBM50043416
Synonyms:
CHEMBL3355482
Type:
Small organic molecule
Emp. Form.:
C21H20N2O3S
Mol. Mass.:
380.46
SMILES:
CN(Cc1ccccc1)C(=O)c1ccc(cc1)S(=O)(=O)Nc1ccccc1
: