Target
Wee1-like protein kinase
Ligand
BDBM50043646
Substrate
Meas. Tech.
ChEMBL_1445054 (CHEMBL3372986)
EC50
100±n/a nM
Citation
 Tong, YTorrent, MFlorjancic, ASBromberg, KDBuchanan, FGFerguson, DCJohnson, EFLasko, LMMaag, DMerta, PJOlson, AMOsterling, DJSoni, NShoemaker, ARPenning, TD Pyrimidine-based tricyclic molecules as potent and orally efficacious inhibitors of wee1 kinase. ACS Med Chem Lett 6:58-62 (2015)  
Target
Name:
Wee1-like protein kinase
Synonyms:
Serine/threonine-protein kinase WEE1 WEE1 homolog (S. pombe) | WEE1_HUMAN
Type:
PROTEIN
Mol. Mass.:
71599.12
Organism:
Homo sapiens (Human)
Description:
ChEMBL_1445054
Residue:
646
  
Inhibitor
Name:
BDBM50043646
Synonyms:
CHEMBL3355531
Type:
Small organic molecule
Emp. Form.:
C26H22ClN7O
Mol. Mass.:
483.952
SMILES:
CN1Cc2cc(Nc3ncc4c(n3)n3ccnc3n(-c3ccccc3Cl)c4=O)ccc2C2(CC2)C1
: