Target
Serine/threonine-protein kinase pim-1
Ligand
BDBM50043655
Substrate
Meas. Tech.
ChEMBL_1445160 (CHEMBL3374860)
IC50
24±n/a nM
Citation
 Xu, YBrenning, BGKultgen, SGFoulks, JMClifford, ALai, SChan, AMerx, SMcCullar, MVKanner, SBHo, KK Synthesis and Biological Evaluation of Pyrazolo[1,5-a]pyrimidine Compounds as Potent and Selective Pim-1 Inhibitors. ACS Med Chem Lett 6:63-7 (2015)  
Target
Name:
Serine/threonine-protein kinase pim-1
Synonyms:
PIM-1 Kinase PIM1_HUMAN Serine/threonine-protein kinase (PIM1) Serine/threonine-protein kinase PIM1 | Serine/threonine-protein kinase pim-1 (PIM1)
Type:
Protein
Mol. Mass.:
35681.82
Organism:
Homo sapiens (Human)
Description:
P11309
Residue:
313
  
Inhibitor
Name:
BDBM50043655
Synonyms:
CHEMBL3355557 US10392392, Example 8-95 US9416132, 8-95
Type:
Small organic molecule
Emp. Form.:
C18H20ClN5
Mol. Mass.:
341.838
SMILES:
N[C@H]1CC[C@@H](CC1)Nc1ccn2ncc(-c3cccc(Cl)c3)c2n1
: