Target
Serine/threonine-protein kinase Sgk1
Ligand
BDBM50043928
Substrate
Meas. Tech.
ChEMBL_1445188 (CHEMBL3375440)
IC50
<1.000000±n/a nM
Citation
 Halland, NSchmidt, FWeiss, TSaas, JLi, ZCzech, JDreyer, MHofmeister, AMertsch, KDietz, UStrübing, CNazare, M Discovery of N-[4-(1H-Pyrazolo[3,4-b]pyrazin-6-yl)-phenyl]-sulfonamides as Highly Active and Selective SGK1 Inhibitors. ACS Med Chem Lett 6:73-8 (2015)  
Target
Name:
Serine/threonine-protein kinase Sgk1
Synonyms:
SGK SGK1_HUMAN Serine/threonine-protein kinase Sgk1 (SGK) Serum/glucocorticoid-regulated kinase 1 (SGK1)
Type:
Other Protein Type
Mol. Mass.:
48954.40
Organism:
Homo sapiens (Human)
Description:
Recombinant human SGK-1 enzyme produced in a baculovirus system.
Residue:
431
  
Inhibitor
Name:
BDBM50043928
Synonyms:
CHEMBL3356023
Type:
Small organic molecule
Emp. Form.:
C19H15ClN4O2S
Mol. Mass.:
398.866
SMILES:
Nc1n[nH]c2cc(ccc12)-c1ccc(NS(=O)(=O)c2ccccc2Cl)cc1
: