Target
Trypsin
Ligand
BDBM50286441
Substrate
Meas. Tech.
ChEMBL_1450738 (CHEMBL3363613)
IC50
>200±n/a nM
Citation
 Liu, LJokela, JWahlsten, MNowruzi, BPermi, PZhang, YZXhaard, HFewer, DPSivonen, K Nostosins, Trypsin Inhibitors Isolated from the Terrestrial Cyanobacterium Nostoc sp. Strain FSN. J Nat Prod 77:1784-90 (2014)  
Target
Name:
Trypsin
Synonyms:
TRYP_PIG
Type:
PROTEIN
Mol. Mass.:
24411.24
Organism:
Sus scrofa
Description:
ChEMBL_1450738
Residue:
231
  
Inhibitor
Name:
BDBM50286441
Synonyms:
(S)-2-((S)-2-Acetylamino-4-(S)-methyl-pentanoylamino)-4-methyl-pentanoic acid (1-formyl-4-guanidino-butyl)-amide (S)-2-Acetylamino-4-methyl-pentanoic acid [(S)-1-((S)-1-formyl-4-guanidino-butylcarbamoyl)-3-methyl-butyl]-amide (S)-2-acetylamino-4-methyl-pentanoic acid [(S)-2-(1-formyl-4-guanidino-butylamino)-4-methyl-pentanoyl]-amide Ac-LLR-CHO CHEMBL129157
Type:
Small organic molecule
Emp. Form.:
C20H38N6O5
Mol. Mass.:
442.5529
SMILES:
CC(C)C[C@H](NC(C)=O)C(=O)N[C@@H](CC(C)C)C(=O)N[C@@H](CCCNC(N)=N)C(O)=O
: