Target
Nuclear receptor ROR-gamma
Ligand
BDBM50044151
Substrate
Meas. Tech.
ChEMBL_1457060 (CHEMBL3369181)
IC50
1.000000±n/a nM
Citation
 Fauber, BPMagnuson, S Modulators of the nuclear receptor retinoic acid receptor-related orphan receptor-¿ (ROR¿ or RORc). J Med Chem 57:5871-92 (2014)  
Target
Name:
Nuclear receptor ROR-gamma
Synonyms:
NR1F3 Nuclear receptor ROR-gamma (RORC) RAR-related orphan receptor C (RORc) RORG RZRG Retinoid-related orphan receptor-gamma (RORc)
Type:
Enzyme Catalytic Domain
Mol. Mass.:
58218.40
Organism:
Homo sapiens (Human)
Description:
P51449
Residue:
518
  
Inhibitor
Name:
BDBM50044151
Synonyms:
CHEMBL3314028
Type:
Small organic molecule
Emp. Form.:
C30H31N3O4
Mol. Mass.:
497.5848
SMILES:
Cc1noc(C)c1CN(CC(O)=O)c1ccc(CC(=O)NC(c2ccccc2)c2ccc(C)cc2)cc1
: