Target
Phosphatidylinositol 4,5-bisphosphate 3-kinase catalytic subunit gamma isoform
Ligand
BDBM50044283
Substrate
Meas. Tech.
ChEMBL_1450782 (CHEMBL3363927)
Ki
7.0±n/a nM
Citation
 Collier, PNMartinez-Botella, GCornebise, MCottrell, KMDoran, JDGriffith, JPMahajan, SMaltais, FMoody, CSHuck, EPWang, TAronov, AM Structural basis for isoform selectivity in a class of benzothiazole inhibitors of phosphoinositide 3-kinase¿. J Med Chem 58:517-21 (2015)  
Target
Name:
Phosphatidylinositol 4,5-bisphosphate 3-kinase catalytic subunit gamma isoform
Synonyms:
PI3-kinase p110 subunit gamma PI3Kgamma PK3CG_HUMAN Phosphatidylinositol 4,5-bisphosphate 3-kinase (PI3K) Phosphatidylinositol 4,5-bisphosphate 3-kinase catalytic subunit gamma (PI3Kgamma) Phosphatidylinositol 4,5-bisphosphate 3-kinase catalytic subunit gamma isoform (PI3K) Phosphatidylinositol-4,5-bisphosphate 3-kinase catalytic subunit gamma isoform Phosphoinositide 3-kinases gamma (PI3K gamma) p120-PI3K
Type:
Enzyme Subunit
Mol. Mass.:
126470.30
Organism:
Homo sapiens (Human)
Description:
P48736
Residue:
1102
  
Inhibitor
Name:
BDBM50044283
Synonyms:
CHEMBL3356893
Type:
Small organic molecule
Emp. Form.:
C16H16N4O2S
Mol. Mass.:
328.389
SMILES:
CCNC(=O)Nc1nc2ccc(cc2s1)-c1cncc(OC)c1
: