Target
ALK tyrosine kinase receptor
Ligand
BDBM50044470
Substrate
Meas. Tech.
ChEMBL_1450833 (CHEMBL3364272)
IC50
32±n/a nM
Citation
 Song, ZYang, YLiu, ZPeng, XGuo, JYang, XWu, KAi, JDing, JGeng, MZhang, A Discovery of novel 2,4-diarylaminopyrimidine analogues (DAAPalogues) showing potent inhibitory activities against both wild-type and mutant ALK kinases. J Med Chem 58:197-211 (2015)  
Target
Name:
ALK tyrosine kinase receptor
Synonyms:
ALK ALK_HUMAN CD_antigen: CD246
Type:
Protein
Mol. Mass.:
176453.10
Organism:
Homo sapiens (Human)
Description:
Q9UM73
Residue:
1620
  
Inhibitor
Name:
BDBM50044470
Synonyms:
CHEMBL3357465
Type:
Small organic molecule
Emp. Form.:
C25H24ClN5O4S
Mol. Mass.:
526.007
SMILES:
CC(C)S(=O)(=O)c1ccccc1Nc1nc(Nc2cccc(NC(=O)Cc3ccco3)c2)ncc1Cl
: