Target
Transcription factor Jun
Ligand
BDBM50044558
Substrate
Meas. Tech.
ChEMBL_1458013 (CHEMBL3367187)
IC50
69600±n/a nM
Citation
 Ye, NDing, YWild, CShen, QZhou, J Small molecule inhibitors targeting activator protein 1 (AP-1). J Med Chem 57:6930-48 (2014)  
Target
Name:
Transcription factor Jun
Synonyms:
AP1 JUN Proto-oncogene c-JUN Transcription factor AP1 p39
Type:
Mol. Mass.:
35683.24
Organism:
Homo sapiens (Human)
Description:
P05412
Residue:
331
  
Inhibitor
Name:
BDBM50044558
Synonyms:
CHEMBL3341961
Type:
Small organic molecule
Emp. Form.:
C28H32O16
Mol. Mass.:
624.5441
SMILES:
[H][C@@]12C(C)=C[C@@](O)(C(=O)O\C=C(/C(O)=O)c3ccc(O)c(OC)c3)[C@@]1([H])[C@H](O[C@]1([H])O[C@H](CO)[C@@H](O)[C@H](O)[C@H]1O)OC=C2C(=O)OC
: