Target
Oxytocin receptor
Ligand
BDBM50044684
Substrate
Meas. Tech.
ChEMBL_1451726 (CHEMBL3366919)
EC50
0.230000±n/a nM
Citation
 Wisniewski, KAlagarsamy, SGalyean, RTariga, HThompson, DLy, BWisniewska, HQi, SCroston, GLaporte, RRivière, PJSchteingart, CD New, potent, and selective peptidic oxytocin receptor agonists. J Med Chem 57:5306-17 (2014)  
Target
Name:
Oxytocin receptor
Synonyms:
OT-R OXYR_HUMAN | Oxytocin
Type:
Enzyme Catalytic Domain
Mol. Mass.:
42793.26
Organism:
Homo sapiens (Human)
Description:
Oxytocin OXTR HEK293::B2R9L7
Residue:
389
  
Inhibitor
Name:
BDBM50044684
Synonyms:
CHEMBL3354596
Type:
Small organic molecule
Emp. Form.:
C48H68FN11O11S
Mol. Mass.:
1026.184
SMILES:
[H][C@]1(NC(=O)[C@H](Cc2ccccc2)NC(=O)CCSCC[C@H](NC(=O)[C@H](CC(N)=O)NC(=O)[C@H](CCC(N)=O)NC1=O)C(=O)N(CC(=O)N[C@@H](CC(C)C)C(=O)NCC(N)=O)Cc1ccc(F)cc1)[C@@H](C)CC
: