Target
Vasopressin V2 receptor
Ligand
BDBM50044777
Substrate
Meas. Tech.
ChEMBL_1451727 (CHEMBL3366920)
EC50
0.050000±n/a nM
Citation
 Wisniewski, KAlagarsamy, SGalyean, RTariga, HThompson, DLy, BWisniewska, HQi, SCroston, GLaporte, RRivière, PJSchteingart, CD New, potent, and selective peptidic oxytocin receptor agonists. J Med Chem 57:5306-17 (2014)  
Target
Name:
Vasopressin V2 receptor
Synonyms:
ADHR AVPR2 DIR Renal-type arginine vasopressin receptor V2R_HUMAN Vasopressin V2 receptor | Vasopressin receptor
Type:
Receptor
Mol. Mass.:
40295.28
Organism:
Homo sapiens (Human)
Description:
P30518
Residue:
371
  
Inhibitor
Name:
BDBM50044777
Synonyms:
Arginine Vasopressin CHEBI:34543 Pitressin Vasopressin
Type:
Small organic molecule
Emp. Form.:
C46H65N15O12S2
Mol. Mass.:
1084.232
SMILES:
N[C@H]1CSSC[C@H](NC(=O)[C@H](CC(N)=O)NC(=O)[C@H](CCC(N)=O)NC(=O)[C@H](Cc2ccccc2)NC(=O)[C@H](Cc2ccc(O)cc2)NC1=O)C(=O)N1CCC[C@H]1C(=O)N[C@@H](CCCNC(N)=N)C(=O)NCC(N)=O
: