Target
Transient receptor potential cation channel subfamily A member 1
Ligand
BDBM50044841
Substrate
Meas. Tech.
ChEMBL_1454389 (CHEMBL3364861)
IC50
74±n/a nM
Citation
 Laliberté, SVallée, FFournier, PABedard, LLabrecque, JAlbert, JS Discovery of a series of aryl-N-(3-(alkylamino)-5-(trifluoromethyl)phenyl)benzamides as TRPA1 antagonists. Bioorg Med Chem Lett 24:3204-6 (2014)  
Target
Name:
Transient receptor potential cation channel subfamily A member 1
Synonyms:
ANKTM1 TRPA1 Transformation-sensitive protein p120 | Transient receptor potential cation channel subfamily A member 1 (TRPA1)
Type:
Protein
Mol. Mass.:
127514.20
Organism:
Homo sapiens (Human)
Description:
O75762
Residue:
1119
  
Inhibitor
Name:
BDBM50044841
Synonyms:
CHEMBL3311192
Type:
Small organic molecule
Emp. Form.:
C16H13F5N2O
Mol. Mass.:
344.2792
SMILES:
CCNc1cc(NC(=O)c2c(F)cccc2F)cc(c1)C(F)(F)F
: