Target
Free fatty acid receptor 4
Ligand
BDBM50044874
Substrate
Meas. Tech.
ChEMBL_1454435 (CHEMBL3365231)
IC50
7.9±n/a nM
Citation
 Sparks, SMChen, GCollins, JLDanger, DDock, STJayawickreme, CJenkinson, SLaudeman, CLeesnitzer, MALiang, XMaloney, PMcCoy, DCMoncol, DRash, VRimele, TVulimiri, PWay, JMRoss, S Identification of diarylsulfonamides as agonists of the free fatty acid receptor 4 (FFA4/GPR120). Bioorg Med Chem Lett 24:3100-3 (2014)  
Target
Name:
Free fatty acid receptor 4
Synonyms:
FFAR4_MOUSE Free fatty acid receptor 4 Gpr120 Omega-3 fatty acid receptor 1
Type:
PROTEIN
Mol. Mass.:
40828.60
Organism:
Mus musculus
Description:
ChEMBL_1454435
Residue:
361
  
Inhibitor
Name:
BDBM50044874
Synonyms:
CHEMBL3311302
Type:
Small organic molecule
Emp. Form.:
C20H17NO3S
Mol. Mass.:
351.419
SMILES:
Cc1ccc(cc1)S(=O)(=O)NC1c2ccccc2Oc2ccccc12
: