Target
Sodium-dependent serotonin transporter
Ligand
BDBM50044849
Substrate
Meas. Tech.
ChEMBL_1455265 (CHEMBL3362271)
IC50
<100000±n/a nM
Citation
 Sparks, SMChen, GCollins, JLDanger, DDock, STJayawickreme, CJenkinson, SLaudeman, CLeesnitzer, MALiang, XMaloney, PMcCoy, DCMoncol, DRash, VRimele, TVulimiri, PWay, JMRoss, S Identification of diarylsulfonamides as agonists of the free fatty acid receptor 4 (FFA4/GPR120). Bioorg Med Chem Lett 24:3100-3 (2014)  
Target
Name:
Sodium-dependent serotonin transporter
Synonyms:
5-HT Transporter 5HTT SC6A4_HUMAN SLC6A4 Serotonin transporter (5HTT) Sodium-dependent serotonin transporter (SERT) | Solute carrier family 6 member 4
Type:
Multi-pass membrane protein
Mol. Mass.:
70322.51
Organism:
Homo sapiens (Human)
Description:
P31645
Residue:
630
  
Inhibitor
Name:
BDBM50044849
Synonyms:
CHEMBL3311308
Type:
Small organic molecule
Emp. Form.:
C16H19NO3S
Mol. Mass.:
305.392
SMILES:
COc1ccc(cc1)S(=O)(=O)Nc1c(C)cc(C)cc1C
: