Target
Chemerin-like receptor 1
Ligand
BDBM50044849
Substrate
Meas. Tech.
ChEMBL_1455282 (CHEMBL3362288)
EC50
<25119±n/a nM
Citation
 Sparks, SMChen, GCollins, JLDanger, DDock, STJayawickreme, CJenkinson, SLaudeman, CLeesnitzer, MALiang, XMaloney, PMcCoy, DCMoncol, DRash, VRimele, TVulimiri, PWay, JMRoss, S Identification of diarylsulfonamides as agonists of the free fatty acid receptor 4 (FFA4/GPR120). Bioorg Med Chem Lett 24:3100-3 (2014)  
Target
Name:
Chemerin-like receptor 1
Synonyms:
CHEMR23 CMKLR1 Chemokine-like receptor 1 G-protein coupled receptor ChemR23 | G-protein coupled receptor DEZ
Type:
PROTEIN
Mol. Mass.:
42333.62
Organism:
Homo sapiens (Human)
Description:
ChEMBL_100822
Residue:
373
  
Inhibitor
Name:
BDBM50044849
Synonyms:
CHEMBL3311308
Type:
Small organic molecule
Emp. Form.:
C16H19NO3S
Mol. Mass.:
305.392
SMILES:
COc1ccc(cc1)S(=O)(=O)Nc1c(C)cc(C)cc1C
: