Target
Short transient receptor potential channel 3
Ligand
BDBM50044849
Substrate
Meas. Tech.
ChEMBL_1456206 (CHEMBL3361961)
EC50
<50119±n/a nM
Citation
 Sparks, SMChen, GCollins, JLDanger, DDock, STJayawickreme, CJenkinson, SLaudeman, CLeesnitzer, MALiang, XMaloney, PMcCoy, DCMoncol, DRash, VRimele, TVulimiri, PWay, JMRoss, S Identification of diarylsulfonamides as agonists of the free fatty acid receptor 4 (FFA4/GPR120). Bioorg Med Chem Lett 24:3100-3 (2014)  
Target
Name:
Short transient receptor potential channel 3
Synonyms:
TRP-3 TRPC3 Transient receptor protein 3 hTrp3
Type:
PROTEIN
Mol. Mass.:
96009.35
Organism:
Homo sapiens (Human)
Description:
ChEMBL_107641
Residue:
836
  
Inhibitor
Name:
BDBM50044849
Synonyms:
CHEMBL3311308
Type:
Small organic molecule
Emp. Form.:
C16H19NO3S
Mol. Mass.:
305.392
SMILES:
COc1ccc(cc1)S(=O)(=O)Nc1c(C)cc(C)cc1C
: