Target
Sodium/glucose cotransporter 1
Ligand
BDBM50044849
Substrate
Meas. Tech.
ChEMBL_1456195 (CHEMBL3361950)
IC50
<39811±n/a nM
Citation
 Sparks, SMChen, GCollins, JLDanger, DDock, STJayawickreme, CJenkinson, SLaudeman, CLeesnitzer, MALiang, XMaloney, PMcCoy, DCMoncol, DRash, VRimele, TVulimiri, PWay, JMRoss, S Identification of diarylsulfonamides as agonists of the free fatty acid receptor 4 (FFA4/GPR120). Bioorg Med Chem Lett 24:3100-3 (2014)  
Target
Name:
Sodium/glucose cotransporter 1
Synonyms:
High affinity sodium-glucose cotransporter Na(+)/glucose cotransporter 1 SGLT1 Sodium-dependent glucose cotransporter 1 (SGLT1) Sodium/glucose cotransporter 1 (SGLT1) | Solute carrier family 5 member 1
Type:
Protein
Mol. Mass.:
73503.78
Organism:
Homo sapiens (Human)
Description:
P13866
Residue:
664
  
Inhibitor
Name:
BDBM50044849
Synonyms:
CHEMBL3311308
Type:
Small organic molecule
Emp. Form.:
C16H19NO3S
Mol. Mass.:
305.392
SMILES:
COc1ccc(cc1)S(=O)(=O)Nc1c(C)cc(C)cc1C
: