Target
Taste receptor type 2 member 16
Ligand
BDBM50044849
Substrate
Meas. Tech.
ChEMBL_1456200 (CHEMBL3361955)
IC50
<39811±n/a nM
Citation
 Sparks, SMChen, GCollins, JLDanger, DDock, STJayawickreme, CJenkinson, SLaudeman, CLeesnitzer, MALiang, XMaloney, PMcCoy, DCMoncol, DRash, VRimele, TVulimiri, PWay, JMRoss, S Identification of diarylsulfonamides as agonists of the free fatty acid receptor 4 (FFA4/GPR120). Bioorg Med Chem Lett 24:3100-3 (2014)  
Target
Name:
Taste receptor type 2 member 16
Synonyms:
T2R16 TAS2R16 | Taste receptor type 2 member 16
Type:
PROTEIN
Mol. Mass.:
34001.15
Organism:
Homo sapiens (Human)
Description:
ChEMBL_109435
Residue:
291
  
Inhibitor
Name:
BDBM50044849
Synonyms:
CHEMBL3311308
Type:
Small organic molecule
Emp. Form.:
C16H19NO3S
Mol. Mass.:
305.392
SMILES:
COc1ccc(cc1)S(=O)(=O)Nc1c(C)cc(C)cc1C
: