Target
1-deoxy-D-xylulose 5-phosphate reductoisomerase
Ligand
BDBM50044976
Substrate
Meas. Tech.
ChEMBL_1448376 (CHEMBL3376860)
Ki
7700±n/a nM
Citation
 Zinglé, CTritsch, DGrosdemange-Billiard, CRohmer, M Catechol-rhodanine derivatives: Specific and promiscuous inhibitors of Escherichia coli deoxyxylulose phosphate reductoisomerase (DXR). Bioorg Med Chem 22:3713-9 (2014)  
Target
Name:
1-deoxy-D-xylulose 5-phosphate reductoisomerase
Synonyms:
1-Deoxy-D-xylulose 5-phosphate reductoisomerase (DXP) 1-deoxy-D-xylulose 5-phosphate reductoisomerase (DXR) DXP reductoisomerase dxr yaeM
Type:
Protein
Mol. Mass.:
43384.52
Organism:
Escherichia coli
Description:
P45568
Residue:
398
  
Inhibitor
Name:
BDBM50044976
Synonyms:
CHEMBL2316879
Type:
Small organic molecule
Emp. Form.:
C12H9NO5S2
Mol. Mass.:
311.334
SMILES:
OC(=O)CN1C(=S)S\C(=C/c2ccc(O)c(O)c2)C1=O
: