Target
Polyunsaturated fatty acid lipoxygenase ALOX15
Ligand
BDBM50024458
Substrate
Meas. Tech.
ChEMBL_1449308 (CHEMBL3371454)
IC50
>25000±n/a nM
Citation
 Armstrong, MMDiaz, GKenyon, VHolman, TR Inhibitory and mechanistic investigations of oxo-lipids with human lipoxygenase isozymes. Bioorg Med Chem 22:4293-7 (2014)  
Target
Name:
Polyunsaturated fatty acid lipoxygenase ALOX15
Synonyms:
15-Lipoxygenase Arachidonate 15-lipoxygenase LOX15_RABIT | Omega-6 lipoxygenase
Type:
Enzyme
Mol. Mass.:
75309.71
Organism:
Oryctolagus cuniculus (rabbit)
Description:
15-LO enzyme was purified from phenylhydrazine treated rabbits.
Residue:
663
  
Inhibitor
Name:
BDBM50024458
Synonyms:
5-oxo-ETE ETE-5-Oxo
Type:
Small organic molecule
Emp. Form.:
C20H30O3
Mol. Mass.:
318.4504
SMILES:
CCCCC\C=C/C\C=C/CC=CC=CC(=O)CCCC(O)=O
: