Target
Polyunsaturated fatty acid lipoxygenase ALOX15B
Ligand
BDBM50045522
Substrate
Meas. Tech.
ChEMBL_1449307 (CHEMBL3371453)
IC50
>100000±n/a nM
Citation
 Armstrong, MMDiaz, GKenyon, VHolman, TR Inhibitory and mechanistic investigations of oxo-lipids with human lipoxygenase isozymes. Bioorg Med Chem 22:4293-7 (2014)  
Target
Name:
Polyunsaturated fatty acid lipoxygenase ALOX15B
Synonyms:
15-LOX-2 15-Lipoxygenase-2 (15-LOX-2) ALOX15B Arachidonate 15-lipoxygenase, type II Epithelial 15-lipoxygenase-2 | LX15B_HUMAN
Type:
Protein
Mol. Mass.:
75850.40
Organism:
Homo sapiens (Human)
Description:
Residue:
676
  
Inhibitor
Name:
BDBM50045522
Synonyms:
CHEBI:68947 | CHEMBL1378466
Type:
Small organic molecule
Emp. Form.:
C18H30O3
Mol. Mass.:
294.429
SMILES:
CCCCCC(=O)\C=C\C=C/CCCCCCCC(O)=O
: