Target
P2Y purinoceptor 1
Ligand
BDBM50045610
Substrate
Meas. Tech.
ChEMBL_1454530 (CHEMBL3365972)
IC50
0.090000±n/a nM
Citation
 Yang, WWang, YLai, AQiao, JXWang, TCHua, JPrice, LAShen, HChen, XQWong, PCrain, EWatson, CHuang, CSSeiffert, DARehfuss, RWexler, RRLam, PY Discovery of 4-aryl-7-hydroxyindoline-based P2Y1 antagonists as novel antiplatelet agents. J Med Chem 57:6150-64 (2014)  
Target
Name:
P2Y purinoceptor 1
Synonyms:
ATP receptor P2RY1_HUMAN P2Y1 Purinergic receptor P2Y1
Type:
Enzyme
Mol. Mass.:
42090.25
Organism:
Homo sapiens (Human)
Description:
P47900
Residue:
373
  
Inhibitor
Name:
BDBM50045610
Synonyms:
CHEMBL3314290 US9540323, example 74
Type:
Small organic molecule
Emp. Form.:
C26H23ClF3N3O5
Mol. Mass.:
549.926
SMILES:
CCOC(=O)C1(C)CN(c2c1c(Cl)ccc2O)c1ccccc1NC(=O)Nc1ccc(OC(F)(F)F)cc1
: