Target
Dipeptidyl peptidase 4
Ligand
BDBM50046174
Substrate
Meas. Tech.
ChEMBL_1447572 (CHEMBL3373767)
IC50
34650±n/a nM
Citation
 Tanwar, OTanwar, LShaquiquzzaman, MAlam, MMAkhter, M Structure based virtual screening of MDPI database: discovery of structurally diverse and novel DPP-IV inhibitors. Bioorg Med Chem Lett 24:3447-51 (2014)  
Target
Name:
Dipeptidyl peptidase 4
Synonyms:
ADABP Adenosine deaminase complexing protein 2 CD_antigen=CD26 DPP4 DPPIV Dipeptidyl peptidase 4 (DPP IV) Dipeptidyl peptidase 4 (DPP4) Dipeptidyl peptidase 4 membrane form Dipeptidyl peptidase IV Dipeptidyl peptidase IV (DDP-IV) Dipeptidyl peptidase IV membrane form Dipeptidyl peptidase-IV (DPP-4) T-cell activation antigen CD26 | TP103
Type:
Enzyme
Mol. Mass.:
88271.01
Organism:
Homo sapiens (Human)
Description:
P27487
Residue:
766
  
Inhibitor
Name:
BDBM50046174
Synonyms:
CHEMBL3310988
Type:
Small organic molecule
Emp. Form.:
C13H14BrFN2
Mol. Mass.:
297.166
SMILES:
Br.Cc1ccc(=N)n(Cc2cccc(F)c2)c1
: