Target
3-oxo-5-alpha-steroid 4-dehydrogenase 1
Ligand
BDBM50187243
Substrate
Meas. Tech.
ChEMBL_1449353 (CHEMBL3372081)
IC50
960000±n/a nM
Citation
 Srivilai, JKhorana, NWaranuch, NSuphrom, NIngkaninan, K Conformational analysis of an anti-androgenic, (E,E)-8-hydroxygermacrene B, using NOESY and dynamic NMR spectroscopy. Bioorg Med Chem Lett 24:3526-9 (2014)  
Target
Name:
3-oxo-5-alpha-steroid 4-dehydrogenase 1
Synonyms:
S5A1_RAT Steroid 5-alpha-reductase | Steroid 5-alpha-reductase 1
Type:
PROTEIN
Mol. Mass.:
29788.29
Organism:
Rattus norvegicus
Description:
ChEMBL_1441437
Residue:
259
  
Inhibitor
Name:
BDBM50187243
Synonyms:
17-ethinyl-3,17-estradiol 17-ethinylestradiol 17alpha-ethynylestra-1,3,5(10)-triene-3,17beta-diol CHEMBL691 Ethinylestradiol ethinyloestradiol
Type:
Small organic molecule
Emp. Form.:
C20H24O2
Mol. Mass.:
296.4034
SMILES:
C[C@]12CC[C@H]3[C@@H](CCc4cc(O)ccc34)[C@@H]1CC[C@@]2(O)C#C
: