Target
UDP-N-acetylmuramoyl-L-alanyl-D-glutamate--2,6-diaminopimelate ligase
Ligand
BDBM50046818
Substrate
Meas. Tech.
ChEMBL_1452800 (CHEMBL3365142)
IC50
93000±n/a nM
Citation
 Perdih, AHrast, MBarreteau, HGobec, SWolber, GSolmajer, T Benzene-1,3-dicarboxylic acid 2,5-dimethylpyrrole derivatives as multiple inhibitors of bacterial Mur ligases (MurC-MurF). Bioorg Med Chem 22:4124-34 (2014)  
Target
Name:
UDP-N-acetylmuramoyl-L-alanyl-D-glutamate--2,6-diaminopimelate ligase
Synonyms:
JW0083 Meso-A2pm-adding enzyme MurE (E. coli) UDP-MurNAc-tripeptide synthetase murE
Type:
Protein
Mol. Mass.:
53333.42
Organism:
Escherichia coli UMNK88 (Enterobacteria)
Description:
P22188
Residue:
495
  
Inhibitor
Name:
BDBM50046818
Synonyms:
CHEMBL3310464
Type:
Small organic molecule
Emp. Form.:
C24H18ClN3O5S
Mol. Mass.:
495.935
SMILES:
Cc1cc(\C=C2\S\C(NC2=O)=N\c2ccc(Cl)cc2)c(C)n1-c1cc(cc(c1)C(O)=O)C(O)=O
: