Target
UDP-N-acetylmuramoyl-L-alanyl-D-glutamate--2,6-diaminopimelate ligase
Ligand
BDBM50046827
Substrate
Meas. Tech.
ChEMBL_1452800 (CHEMBL3365142)
IC50
44000±n/a nM
Citation
 Perdih, AHrast, MBarreteau, HGobec, SWolber, GSolmajer, T Benzene-1,3-dicarboxylic acid 2,5-dimethylpyrrole derivatives as multiple inhibitors of bacterial Mur ligases (MurC-MurF). Bioorg Med Chem 22:4124-34 (2014)  
Target
Name:
UDP-N-acetylmuramoyl-L-alanyl-D-glutamate--2,6-diaminopimelate ligase
Synonyms:
JW0083 Meso-A2pm-adding enzyme MurE (E. coli) UDP-MurNAc-tripeptide synthetase murE
Type:
Protein
Mol. Mass.:
53333.42
Organism:
Escherichia coli UMNK88 (Enterobacteria)
Description:
P22188
Residue:
495
  
Inhibitor
Name:
BDBM50046827
Synonyms:
CHEMBL3310467
Type:
Small organic molecule
Emp. Form.:
C19H12ClN3O2S
Mol. Mass.:
381.835
SMILES:
Clc1ccc(cc1)N1C(=S)NC(=O)\C(=C\c2cc3ccccc3[nH]2)C1=O
: